{"text_format":"1","workbook":"xlsx","n_sheets":15,"sheets":["EDT","Reporter","UserMap","Departments","PostList","MasterList","DataP","DataED","DataAC","DataLR","DataAD","DataFam","Master Cadre","DataDYN","DataNom"],"not_rendered":{"charts":0,"images":1,"macros":1,"external_links":0,"defined_names":0,"comments":0,"pivot_tables":0},"unopened":[],"bounds":{"document_bytes":16777216,"sheet_cells":100000,"rows_first":2000,"rows_last":500,"rows_between":2000,"halvings":0,"cell_chars":16384,"cell_head_chars":4096},"cells_cut":0,"cells_raw":0,"read":"whole","date_system":"1900"}

{"sheet":"EDT","index":0,"n_rows":0,"n_cols":0,"rows_kept":0,"cut":false,"hidden":false,"merged":[]}

{"sheet":"Reporter","index":1,"n_rows":156,"n_cols":9,"rows_kept":156,"cut":false,"hidden":true,"merged":[[147,5,147,7],[149,4,149,8],[154,1,154,2],[155,1,155,2],[155,4,155,8],[146,2,146,4],[146,5,146,7],[141,0,141,1],[141,2,141,8],[142,0,142,1],[142,2,142,8],[143,0,143,1],[143,2,143,8],[145,0,145,1],[145,2,145,8],[136,0,136,1],[136,2,136,8],[137,0,137,1],[137,2,137,8],[139,0,139,8],[140,0,140,8],[133,0,133,1],[133,2,133,8],[134,0,134,1],[134,2,134,8],[135,0,135,1],[135,2,135,8],[128,0,128,2],[128,3,128,7],[130,0,130,8],[131,0,131,8],[132,0,132,1],[132,2,132,8],[125,0,125,2],[125,3,125,7],[126,0,126,2],[126,3,126,7],[127,0,127,2],[127,3,127,7],[121,0,121,2],[121,3,121,7],[122,0,122,2],[122,3,122,7],[123,0,123,8],[124,0,124,2],[124,3,124,7],[116,0,116,8],[117,0,117,6],[117,7,117,8],[118,0,118,6],[118,7,118,8],[120,0,120,8],[110,0,110,4],[110,5,110,6],[112,0,112,8],[113,0,113,6],[113,7,113,8],[114,0,114,6],[114,7,114,8],[106,0,106,1],[106,2,106,8],[108,0,108,8],[109,1,109,2],[109,3,109,4],[109,5,109,6],[103,0,103,1],[103,2,103,8],[104,0,104,1],[104,2,104,8],[105,0,105,1],[105,2,105,8],[98,0,98,1],[98,2,98,8],[99,0,99,1],[99,2,99,8],[101,0,101,8],[102,0,102,8],[95,0,95,1],[95,2,95,8],[96,0,96,1],[96,2,96,8],[97,0,97,1],[97,2,97,8],[89,0,89,1],[89,2,89,8],[90,2,90,8],[91,2,91,8],[92,2,92,8],[94,0,94,1],[94,2,94,8],[86,0,86,1],[86,2,86,8],[87,0,87,1],[87,2,87,8],[88,0,88,1],[88,2,88,8],[82,0,82,2],[82,3,82,8],[83,0,83,8],[84,0,84,1],[84,2,84,8],[85,0,85,1],[85,2,85,8],[79,0,79,2],[79,3,79,8],[80,0,80,2],[80,3,80,8],[81,0,81,2],[81,3,81,8],[76,0,76,2],[76,3,76,8],[77,0,77,2],[77,3,77,8],[78,0,78,2],[78,3,78,8],[73,0,73,2],[73,3,73,8],[74,0,74,2],[74,3,74,8],[75,0,75,2],[75,3,75,8],[68,1,69,7],[70,0,70,8],[71,0,71,2],[71,3,71,8],[72,0,72,2],[72,3,72,8],[64,0,64,8],[65,0,65,2],[65,3,65,4],[66,0,66,2],[66,3,66,4],[67,0,67,8],[61,0,61,2],[61,3,61,8],[62,0,62,2],[62,3,62,8],[63,0,63,2],[63,3,63,8],[57,0,57,8],[58,0,58,1],[58,2,58,8],[59,0,59,1],[59,2,59,8],[60,0,60,1],[60,2,60,8],[54,0,54,2],[54,3,54,8],[55,0,55,1],[55,2,55,8],[56,0,56,2],[56,3,56,8],[50,0,50,1],[50,2,50,8],[52,0,52,1],[52,2,52,8],[53,0,53,1],[53,2,53,8],[46,0,46,8],[47,0,47,1],[47,2,47,8],[48,0,48,1],[48,2,48,8],[49,0,49,1],[49,2,49,8],[42,2,42,3],[42,4,42,5],[42,6,42,7],[44,0,44,8],[45,0,45,3],[45,4,45,6],[37,0,37,1],[38,0,38,1],[38,3,38,4],[38,6,38,7],[40,0,40,8],[41,2,41,3],[41,4,41,5],[41,6,41,7],[34,0,34,1],[34,2,34,8],[35,0,35,1],[35,2,35,8],[36,0,36,1],[36,2,36,8],[29,0,29,1],[29,2,29,3],[29,4,29,5],[32,0,32,8],[33,0,33,1],[33,2,33,8],[26,2,26,3],[26,4,26,5],[27,0,27,1],[27,2,27,3],[27,4,27,5],[28,0,28,1],[28,2,28,3],[28,4,28,5],[22,0,22,1],[22,2,22,8],[23,0,23,1],[23,2,23,8],[24,0,24,8],[25,0,25,1],[25,2,25,8],[19,0,19,1],[19,2,19,8],[20,0,20,1],[20,2,20,8],[21,0,21,1],[21,2,21,8],[16,0,16,1],[16,2,16,8],[17,0,17,1],[17,2,17,8],[18,0,18,1],[18,2,18,8],[13,0,13,1],[13,2,13,8],[14,0,14,1],[14,2,14,8],[15,0,15,1],[15,2,15,8],[9,0,9,8],[10,0,10,1],[10,2,10,8],[11,0,11,1],[11,2,11,8],[12,0,12,1],[12,2,12,8],[8,0,8,2],[8,3,8,8],[4,0,4,8],[5,0,5,1],[5,2,5,3],[5,4,5,5],[5,6,5,7],[6,0,6,1],[6,2,6,3],[6,4,6,5],[6,6,6,7],[0,0,0,8],[1,0,1,8],[2,0,2,1],[2,2,2,8],[3,0,3,1],[3,2,3,8],[7,0,7,1],[7,2,7,3],[7,4,7,5],[7,6,7,7]]}
["Employee Details"]
["DDO Code:  101001"]
["Name:",null,"Mr. A B C"]
["GPF",null,10088]
["Personal Information"]
["Date of Birth:",null,"2014-01-23",null,"Gender:",null,"Female"]
["Marital Status:",null,"Divorced",null,"Category:",null,"Others"]
["Blood Group:",null,"A-",null,"Height:"]
["Personal Identification Marks:"]
["Address"]
["Permanent:",null,12]
[]
[null,null,234]
[null,null,"-D1-Andaman and Nicobar Islands"]
[null,null,12345]
[null,null," 0- 0"]
["Present:",null,12]
[]
[null,null,234]
[null,null,"-D1-Andaman and Nicobar Islands"]
{"$rows_left_out":137}
{"sheet":"UserMap","index":2,"n_rows":724,"n_cols":9,"rows_kept":724,"cut":false,"hidden":true,"merged":[]}
[{"$f":"COUNTA(A3:A1048576)","v":722}]
["ID","DDO Code","DDO","Department","Ministry","Treasury","Treasury Code","Password"]
[1,101001,"Secretary, Legislative Assembly","Legislative Assembly","Legislative Assembly","Aizawl South","090101","xxx}ad~a\u0004\u0002\u0002\u0003",{"$f":"VLOOKUP(E3,Departments!B$3:C$83,2,FALSE)","v":"Legislative Assembly"}]
[2,102001,"Secretary, Governor Secretariat","Governor Secretariat","Governor Secretariat","Aizawl South","090101","xxx}aa~a\u0004\u0002\u0002\u0002",{"$f":"VLOOKUP(E4,Departments!B$3:C$83,2,FALSE)","v":"Governor Secretariat"}]
[3,103001,"Secretary to Chief Minister Office","Chief Minister Office","Council of Ministers","Aizawl North","090102","xxx}ab~a\u0004\u0002\u0002\u0001",{"$f":"VLOOKUP(E5,Departments!B$3:C$83,2,FALSE)","v":"Chief Minister Office"}]
[4,103002,"Under Secretary, SAD","SAD","Council of Ministers","Aizawl South","060101","xxx}ab~a\u0001\u0002\u0002\u0001",{"$f":"VLOOKUP(E6,Departments!B$3:C$83,2,FALSE)","v":"Chief Minister Office"}]
[5,104001,"Secretary, Law & Judicial","LAW & JUDICIAL","LAW & JUDICIAL","Aizawl South","090101","xxx}ag~a\u0004\u0002\u0002\b",{"$f":"VLOOKUP(E7,Departments!B$3:C$83,2,FALSE)","v":"Gauhati High Court, Aizawl Bench"}]
[6,104002,"Member Secretary MSLSA","LAW & JUDICIAL","LAW & JUDICIAL","Aizawl South","090101","xxx}ag~a\u0001\u0002\u0002\b",{"$f":"VLOOKUP(E8,Departments!B$3:C$83,2,FALSE)","v":"Gauhati High Court, Aizawl Bench"}]
[7,104003,"District Session Judge","LAW & JUDICIAL","LAW & JUDICIAL","Aizawl South","090101","xxx}ag~a\u0002\u0002\u0002\b",{"$f":"VLOOKUP(E9,Departments!B$3:C$83,2,FALSE)","v":"Gauhati High Court, Aizawl Bench"}]
[8,104004,"P.O., Motor Accident Claim Tribunal","LAW & JUDICIAL","LAW & JUDICIAL","Aizawl South","090101","xxx}ag~a\u0007\u0002\u0002\b",{"$f":"VLOOKUP(E10,Departments!B$3:C$83,2,FALSE)","v":"Gauhati High Court, Aizawl Bench"}]
[9,104005,"Registrar, Gauhati High Court","Gauhati High Court, Aizawl Bench","LAW & JUDICIAL","Aizawl North","090102","xxx}ag~a\b\u0002\u0002\b",{"$f":"VLOOKUP(E11,Departments!B$3:C$83,2,FALSE)","v":"Gauhati High Court, Aizawl Bench"}]
[10,104006,"District Session Judge, Lunglei","LAW & JUDICIAL","LAW & JUDICIAL","Lunglei","090201","xxx}ag~a\u0005\u0002\u0002\b",{"$f":"VLOOKUP(E12,Departments!B$3:C$83,2,FALSE)","v":"Gauhati High Court, Aizawl Bench"}]
[11,104007,"Chief Judicial Magistrate, Saiha","LAW & JUDICIAL","LAW & JUDICIAL","Saiha","090301","xxx}ag~a\u0006\u0002\u0002\b",{"$f":"VLOOKUP(E13,Departments!B$3:C$83,2,FALSE)","v":"Gauhati High Court, Aizawl Bench"}]
[12,104008,"Magistrate A.S.D.C.C,Champhai","LAW & JUDICIAL","LAW & JUDICIAL","Champhai","090401","xxx}ag~a\u000b\u0002\u0002\b",{"$f":"VLOOKUP(E14,Departments!B$3:C$83,2,FALSE)","v":"Gauhati High Court, Aizawl Bench"}]
[13,104009,"Civil Judge (ADMJ), Koasib","LAW & JUDICIAL","LAW & JUDICIAL","Kolasib","090501","xxx}ag~a\f\u0002\u0002\b",{"$f":"VLOOKUP(E15,Departments!B$3:C$83,2,FALSE)","v":"Gauhati High Court, Aizawl Bench"}]
[14,104010,"Judicial Magistrate, Serchhip ","LAW & JUDICIAL","LAW & JUDICIAL","Serchhip ","090601","xxx}ag~b\u0003\u0002\u0002\b",{"$f":"VLOOKUP(E16,Departments!B$3:C$83,2,FALSE)","v":"Gauhati High Court, Aizawl Bench"}]
[15,104011,"Chief Judicial Magistrate, Lawngtlai","LAW & JUDICIAL","LAW & JUDICIAL","Lawngtlai","090701","xxx}ag~b\u0004\u0002\u0002\b",{"$f":"VLOOKUP(E17,Departments!B$3:C$83,2,FALSE)","v":"Gauhati High Court, Aizawl Bench"}]
[16,104012,"Chief Judicial Magistrate, Lawngtlai","LAW & JUDICIAL","LAW & JUDICIAL","Mamit","090801","xxx}ag~b\u0001\u0002\u0002\b",{"$f":"VLOOKUP(E18,Departments!B$3:C$83,2,FALSE)","v":"Gauhati High Court, Aizawl Bench"}]
[17,105001,"Chief Vigilance Officer","VIGILANCE","VIGILANCE","Aizawl South","090101","xxx}ah~a\u0004\u0002\u0002\u0007",{"$f":"VLOOKUP(E19,Departments!B$3:C$83,2,FALSE)","v":{"$error":"#N/A"}}]
[18,105002,"Supdt.Police, Anti-Corruption Bureau","Anti-Corruption Bureau","VIGILANCE","Aizawl South","090101","xxx}ah~a\u0001\u0002\u0002\u0007",{"$f":"VLOOKUP(E20,Departments!B$3:C$83,2,FALSE)","v":{"$error":"#N/A"}}]
{"$rows_left_out":705}
{"sheet":"Departments","index":3,"n_rows":87,"n_cols":6,"rows_kept":87,"cut":false,"hidden":true,"merged":[]}
[{"$f":"COUNTA(A3:A1048576)","v":85},null,null,null,{"$f":"COUNTA(E3:E1048576)","v":49}]
["ID","Ministry",null,null,"ID","Ministry"]
[1,"A.H. & VETY.","A.H. & VETY.",null,1,"A.H. & VETY."]
[2,"AGRICULTURE","AGRICULTURE(CH)",null,2,"AGRICULTURE"]
[3,"AGRICULTURE","AGRICULTURE(R&E)",null,3,"ART & CULTURE"]
[4,"ART & CULTURE","ART & CULTURE",null,4,"CENTRAL MINISTRY OF FINANCE"]
[5,"CENTRAL MINISTRY OF FINANCE","Accountant General",null,5,"COOPERATION"]
[6,"COOPERATION","COOPERATION",null,6,"Council of Ministers"]
[7,"Council of Ministers","Chief Minister Office",null,7,"DISASTER MANAGEMENT & REHABILITATION"]
[8,"Council of Ministers","SAD",null,8,"DISTRICT COUNCIL"]
[9,"DISASTER MANAGEMENT & REHABILITATION","DISASTER \nMANAGEMENT &\nREHABILITATION",null,9,"EXCISE & NARCOTICS"]
[10,"DISTRICT COUNCIL","CADC",null,10,"FINANCE"]
[11,"DISTRICT COUNCIL","LADC",null,11,"FISHERIES"]
[12,"DISTRICT COUNCIL","MADC",null,12,"FOOD CIVIL SUPPLIES & CONSUMER AFFAIRS"]
[13,"EXCISE & NARCOTICS","EXCISE & NARCOTICS",null,13,"GAD"]
[14,"FINANCE","ACCOUNTS & TREASURIES",null,14,"Governor Secretariat"]
[15,"FINANCE","Finance",null,15,"HEALTH & FAMILY WELFARE"]
[16,"FINANCE","IF & SL",null,16,"HIGHER &  TECHNICAL EDUCATION"]
[17,"FINANCE","State Finance Commission",null,17,"HOME"]
[18,"FISHERIES","FISHERIES",null,18,"HORTICULTURE"]
{"$rows_left_out":68}
{"sheet":"PostList","index":4,"n_rows":2876,"n_cols":6,"rows_kept":2876,"cut":false,"hidden":true,"merged":[]}
[{"$f":"COUNTA(A3:A1048576)","v":2874},null,null,null,null,{"$f":"COUNTA(F3:F1048576)","v":32}]
["S.No.","Ministry","Post",null,"Pay Band","Grade"]
[1,"A.H. & VETY.","Artist",null,0,1650]
[2,"A.H. & VETY.","Assistant ",null,1,1800]
[3,"A.H. & VETY.","Asst. Engineer",null,1,1900]
[4,"A.H. & VETY.","Asst. Engineer (Mech)",null,1,2000]
[5,"A.H. & VETY.","Asst. Genl. Manager, (Mampui)",null,1,2400]
[6,"A.H. & VETY.","Bull Attendant",null,1,2800]
[7,"A.H. & VETY.","Cattle Attendant",null,1,4200]
[8,"A.H. & VETY.","Chowkidar",null,1,4400]
[9,"A.H. & VETY.","Cinema Operator",null,1,4600]
[10,"A.H. & VETY.","Computer Operator",null,1,4800]
[11,"A.H. & VETY.","Dairy Supdt.",null,2,4200]
[12,"A.H. & VETY.","Data Entry Operator",null,2,4400]
[13,"A.H. & VETY.","Director",null,2,4600]
[14,"A.H. & VETY.","Dist. AH & VO",null,2,4800]
[15,"A.H. & VETY.","Dozer Operator",null,2,5400]
[16,"A.H. & VETY.","Driver-I Grade",null,2,6100]
[17,"A.H. & VETY.","Driver-II Grade",null,2,6600]
[18,"A.H. & VETY.","Driver-III Grade",null,2,7100]
{"$rows_left_out":2857}
{"sheet":"MasterList","index":5,"n_rows":37,"n_cols":23,"rows_kept":37,"cut":false,"hidden":true,"merged":[]}
[{"$f":"COUNTA(A3:A1048576)","v":4},2,5,4,8,35,7,9,6,8,14,13,{"$f":"COUNTA(M3:M1048576)","v":4},4,9,4,3,4,{"$f":"COUNTA(S3:S1048576)","v":10},{"$f":"COUNTA(T3:T1048576)","v":18},{"$f":"COUNTA(U3:U1048576)","v":4},{"$f":"COUNTA(V3:V1048576)","v":16},{"$f":"COUNTA(W3:W1048576)","v":4}]
["Title","Gender","Marital Status","Caste","Blood Group","State","Spouse Employee","EduLevel","EduField","Mode of Allotment","Loans","Pay Band","Grade","Group of Post","Type of Deployment","Where Deployed","Post Classification","Post type","Treasuries","Allowances","Deductions","Family","Nominations"]
["Dr.","Female","Divorced","Others","A-","Andaman and Nicobar Islands","Central Government","Diploma","Arts","Absorption","Conveyance Advance","1S (4440 - 7440)","Grade I","Group A","Lien ","Deputation to Central Government/Organisation","Permanent","CSS","Aizawl North","Cash Handling Allowance","MGEGIS-Insurance Fund","Brother","GPF"]
["Mr.","Male","Married","SC","A+","Andhra Pradesh","Local Authorities","Doctorate","Commerce","Direct","Cycle Advance","PB-1 (5200 - 20200)","Grade II","Group B","Long Term Leave","Deputation to State Government Organisation/Undetaking","Temporary","Grants-in-Aid","Aizawl South","Dearness Allowances","MGEGIS-Savings Fund","Daughter","DCRG"]
["Mrs.",null,"Separated","SEBC/OBC","AB-","Arunachal Pradesh","NGO","Graduation","Engineering","Limited Departmental Examination","Fan Advance","PB-2 (9300 - 34800)","Grade III","Group C","Long Term Training","Foreign Body","Work Charge","Non Plan","Lunglei","Family Planning Allowance ","New Pension Scheme","Father","MGEGIS"]
["Ms.",null,"Single","ST","AB+","Assam","Others","Intermediate","Medical Sciences","Promotion","Festival Advance","PB-3 (15600 - 39100)","Grade IV","Group D","On Deputation","State Government",null,"Plan","Serchhip","Gestetner Operating Allowance","Professional Tax","Grandfather","NPS"]
[null,null,"Widowed",null,"B-","Bihar","Private","Master of Philisophy","Others","Redeployment","Flood/Drought/Cyclone Advance","PB-4 (37400 - 67000)",null,null,"On Duty/Post",null,null,null,"Champhai","House Rent Allowance",null,"Grandmother"]
[null,null,null,null,"B+","Chandigarh","State Government","Matric","Science","Regularization","Hindi Training Advance","HAG (69000 - 79000)",null,null,"Study Leave",null,null,null,"Saiha","Kit Maintenance Allowance",null,"Mother"]
[null,null,null,null,"O-","Chhattisgarh","Unemployed","Post-Doctorate",null,"Selection","House Building Advance","HAG+Scale (75500 - 80000)",null,null,"Unauthorised Posting",null,null,null,"Lawngtlai","Leave Compensaory Allowance",null,"Sister"]
[null,null,null,null,"O+","Dadra and Nagar Haveli",null,"Post-Graduation",null,"Validation","House Building Advance (HUDCO)","Apex (80000)",null,null,"Under Suspension",null,null,null,"Mamit","Non-Practising Allowance",null,"Son"]
[null,null,null,null,null,"Daman and Diu",null,"Under Matric",null,null,"House Building Advance (LIC)","Cabinet Secretary (90000)",null,null,"Waiting for Posting",null,null,null,"Kolasib","Nursing Allowance",null,"Son's Daughter"]
[null,null,null,null,null,"Goa",null,null,null,null,"Motor Car Advance","FIXED",null,null,null,null,null,null,"Chawngte","Ration Money",null,"Son's Son"]
[null,null,null,null,null,"Gujarat",null,null,null,null,"Motor Cycle/Scooter Advance","CONTRACT",null,null,null,null,null,null,null,"Rifle Allowance",null,"Son's Spouse"]
[null,null,null,null,null,"Haryana",null,null,null,null,"Personal Computer Advance","MUSTER",null,null,null,null,null,null,null,"Special Compensatory (Remote Locality) Allowance",null,"Spouse"]
[null,null,null,null,null,"Himachal Pradesh",null,null,null,null,"Typewriter Advance","CO-TERMINUS",null,null,null,null,null,null,null,"Training Allowance",null,"Step-Father"]
[null,null,null,null,null,"Jammu and Kashmir",null,null,null,null,"Warm Clothing Advance",null,null,null,null,null,null,null,null,"Transport Allowance",null,"Step-Mother"]
[null,null,null,null,null,"Jharkhand",null,null,null,null,null,null,null,null,null,null,null,null,null,"Uniform Allowance",null,"Adopted Son"]
[null,null,null,null,null,"Karnataka",null,null,null,null,null,null,null,null,null,null,null,null,null,"Washing Allowance",null,"Adopted Daughter"]
[null,null,null,null,null,"Kerala",null,null,null,null,null,null,null,null,null,null,null,null,null,"Special Allowance"]
[null,null,null,null,null,"Lakshadweep",null,null,null,null,null,null,null,null,null,null,null,null,null,"North-east Allowance"]
{"$rows_left_out":18}
{"sheet":"DataP","index":6,"n_rows":3,"n_cols":149,"rows_kept":3,"cut":false,"hidden":true,"merged":[]}
[{"$f":"COUNTA(A3:A1048576)","v":1},{"$f":"COUNTA(2:2)","v":149},null,null,null,null,null,null,null,1,1,1,1,null,null,null,1,null,1,null,1,1,1,null,null,null,null,null,null,null,null,null,null,null,null,null,null,null,null,null,null,null,null,null,null,null,null,null,null,null,null,null,null,null,null,null,null,null,null,null,null,null,null,null,null,null,1,1,1,1,1,1,null,null,null,null,null,null,1,null,null,null,null,null,null,null,1,1,1,1,1,1,1,null,1,1,1,1,1,1,1,null,null,null,null,null,null,null,null,null,null,null,null,null,null,null,null,null,null,null,null,null,null,null,1,1,null,null,null,null,null,null,null,null,1,null,1,null,null,null,null,null,null,1,1]
["ID","DDOCode","Status","Title","First Name","Middle Name","Last Name","GPF/NPS","GPF/NPS No.","DOB","Gender","Marital Status","Caste","Blood Group","Height","PI Mark","Permanent Address1","Line2","Village/Town/City","Block","District","Pin","State","STD","Phone","Is Permanent same as present","Present Address1","Line2","Village/Town/City","Block","District","Pin","State","STD","Phone","Mobile","Email","PAN","EPIC","EPIC Place","EPIC Date","DL","DLPLace","DLIssue","DLExpiry","PP","PPPLace","PPIssue","PPExpiry","Cancelled","Cancelled","Cancelled","Cancelled","Cancelled","Cancelled","Cancelled","Cancelled","Cancelled","Cancelled","Cancelled","Cancelled","Cancelled","Cancelled","Cancelled","Cancelled","Cancelled","Start Date","First Post","Order No","Appointing Authority","Order Date","Cadre?","Name","Grade","Authority","Year","Cadre Level","CANCELLED","Cadre?","CadreName","Grade","Allotment","CadreAuthority","Date of Appointment","Cadre Level","Cadre Department","ServiceBook Available?","Date of Last Entry","Date of last verification","Place of Service Book","Deployment","Where","Post","GenericPost","Place","Group","Class","Type","Headquarters","Department","Date of Joining","Office","OffAdd1","OffAdd2","Off Town","Off Block","Off District","Off Pin","Off State","Off STD","Off Phone","Off Ext","Off STDfx","Off Fax","Off Email","Headquarters","Head Add1","Head Add2","Head Town","head Block","head District","Head PinCode","Head State","Grade Pay","Pay Band","Band Pay","Cancelled","Cancelled","Cancelled","Cancelled","Cancelled","Cancelled","Cancelled","Cancelled","Mandatory GPF","Voluntary  GPF","Impounded DA","Recovery Amount","Installment No.","Total Installments","Approval No.","Foreign Body","Treasury","Date","Time","PRAN","GPF Advance Amount","Date of Paybill","Remarks"]
[1,104001,0,"Mr.","A","B","C","GPF No.","DDJDPOE908",null,null,null,null,null,null,null,null,null,null,null,null,null,null,null,null,null,null,null,null,null,null,null,null,null,null,null,null,null,null,null,null,null,null,null,null,null,null,null,null,null,null,null,null,null,null,null,null,null,null,null,null,null,null,null,null,null,null,null,null,null,null,false,null,null,null,null,null,null,true,8,2,5,0,null,null,null,false,null,null,null,null,null,null,null,null,null,null,null,null,null,null,null,null,null,null,null,null,null,null,null,null,null,null,null,null,null,null,null,null,null,null,null,null,null,null,null,null,null,null,null,null,null,null,null,null,null,null,null,null,null,null,null,null,"2014-02-05","14:10:46"]

{"sheet":"DataED","index":7,"n_rows":2,"n_cols":8,"rows_kept":2,"cut":false,"hidden":true,"merged":[]}
[{"$f":"COUNTA(A3:A1048576)","v":0}]
["ID","EMPID","Level","Field","Qualification","Institute","Board","Year of Award"]

{"sheet":"DataAC","index":8,"n_rows":2,"n_cols":6,"rows_kept":2,"cut":false,"hidden":true,"merged":[]}
[{"$f":"COUNTA(A3:A1048576)","v":0}]
["S.No.","EMPID","Ministry","Department","Post","Office"]

{"sheet":"DataLR","index":9,"n_rows":2,"n_cols":9,"rows_kept":2,"cut":false,"hidden":true,"merged":[]}
[{"$f":"COUNTA(A3:A1048576)","v":0}]
["S.No.","EMPID","Type","Amount","Monthly Recovery Amount","Installment No.","Total Installments","Loan No.","Monthly Recovery Amount Type"]

{"sheet":"DataAD","index":10,"n_rows":2,"n_cols":13,"rows_kept":2,"cut":false,"hidden":true,"merged":[]}
[{"$f":"COUNTA(A3:A1048576)","v":0},null,null,null,null,null,null,null,null,{"$f":"COUNTA(J3:J1048576)","v":0}]
["S.No.","EMPID","Allowance","Amount",null,null,null,null,null,"S.No.","EMPID","Deductions","Amount"]

{"sheet":"DataFam","index":11,"n_rows":2,"n_cols":14,"rows_kept":2,"cut":false,"hidden":true,"merged":[]}
[{"$f":"COUNTA(A3:A1048576)","v":0}]
["ID","EMPID","Relationship","Title","First Name","Last Name","Marital Status","Employment","Date of Birth","GPF/NPS","GPF/PPAN","Medical","Pension","Travel"]

{"sheet":"Master Cadre","index":12,"n_rows":2131,"n_cols":18,"rows_kept":2131,"cut":false,"hidden":true,"merged":[]}
[{"$f":"COUNTA(A3:A1048576)","v":10},null,{"$f":"COUNTA(C3:C1048576)","v":17},null,null,null,{"$f":"COUNTA(G3:G1048576)","v":14}]
["Cadres",null,"Cadre","Cadre Department",null,null,"Cadres","Count"]
["Mizoram Finance & Accounts Service",null,0,"Finance Department",null,null,0,6,"Junior Grade","Senior Grade","JAG","Selection Grade","Supertime Grade B","Supertime Grade A"]
["Mizoram Civil Service",null,1,"DPAR (CSW)",null,null,1,6,"Junior Grade","Senior Grade","JAG","Selection Grade","Supertime Grade B","Supertime Grade A"]
["Mizoram Police Service",null,2,"Home Department",null,null,2,5,"Junior Grade","Senior Grade","JAG","Selection Grade","SAG"]
["Mizoram Engineering Service",null,3,"Public Works Department\n",null,null,3,6,"Junior Grade","Senior Grade","JAG","SAG","Selection Grade","Grade - I(A)"]
["Mizoram Planning, Economics & Statistical Service",null,3,"PHED",null,null,4,5,"Junior Grade","Senior Grade","JAG","Selection Grade","Supertime Grade"]
["Mizoram Forest Service",null,3,"Power & Electricity Department",null,null,5,4,"Junior Grade","Senior Grade","JAG","Selection Grade"]
["Mizoram Secretariat Service (Steno)",null,4,"Planing & Programme Implementation",null,null,6,3,"Junior Grade","Senior Grade","JAG"]
["Mizoram Secretariat Service (Ministerial)",null,5,"Forest Department",null,null,7,6,"Junior Grade","Senior Grade","JAG","Selection Grade","Supertime Grade B","Supertime Grade"]
["Mizoram Information Service",null,6,"DPAR (SSW)",null,null,8,4,"Junior Grade","Senior Grade","JAG","Selection Grade"]
["Mizoram Health Service",null,7,"DPAR (SSW)",null,null,9,6,"Grade III","Grade II","Grade I","Spl. Grade","Supertime Grade B","Supertime Grade A"]
[null,null,8,"Information and Public Relation Department",null,null,10,4,"Cat. III","Cat. II","Cat. I","Spl Grade/ Addl. RCS"]
[null,null,9,"Health Department ",null,null,11,5,"Grade-V","Grade-IV","Grade-III","Grade-II","Grade-I"]
[null,null,10,"Co-operative Department",null,null,12,5,"Grade-V","Grade-IV","Grade-III","Grade-II","Grade-I"]
[null,null,11,"AH &Vety Department",null,null,13,10,"Administrative Subedar","Assistant to District Commandant","Assistant","Boot Maker","Barber","Cook","Dhobi","Laboratory Assistant","Sweeper","Water Carrier"]
[null,null,12,"Horticulture Department"]
[null,null,13,"Home Department"]
[]
[]
{"$rows_left_out":2112}
{"sheet":"DataDYN","index":13,"n_rows":2,"n_cols":67,"rows_kept":2,"cut":false,"hidden":true,"merged":[]}
[{"$f":"COUNTA(A3:A1048576)","v":0},null,null,null,null,null,null,null,null,{"$f":"COUNTA(J3:J1048576)","v":0},null,null,null,null,null,null,{"$f":"COUNTA(Q3:Q1048576)","v":0},null,null,null,null,null,null,null,null,null,{"$f":"COUNTA(AA3:AA1048576)","v":0},null,null,null,null,null,{"$f":"COUNTA(AG3:AG1048576)","v":0},null,null,null,null,null,null,{"$f":"COUNTA(AN3:AN1048576)","v":0},null,null,null,null,null,null,null,null,null,null,null,null,null,{"$f":"COUNTA(BB3:BB1048576)","v":0},null,null,null,null,null,null,null,{"$f":"COUNTA(BJ3:BJ1048576)","v":0}]
["ID","EMPID","Level","Field","Qualification","Institute","Board","Year of Award",null,"S.No.","EMPID","Ministry","Department","Post","Office",null,"S.No.","EMPID","Type","Amount","Monthly Recovery Amount","Installment No.","Total Installments","Loan No.","Monthly Recovery Amount Type",null,"S.No.","EMPID","Allowance","Amount",null,null,"S.No.","EMPID","Allowance","Amount",null,null,null,"ID","EMPID","Relationship","Title","First Name","Middle Name","Last Name","Employment","Date of Birth","GPF/NPS","GPF/PPAN","Medical","Pension","Travel","ID","EMPID","Type","Name","Relationship","Allocation",null,null,"ID","EMPID","Type","Name","Relationship","Allocation"]

{"sheet":"DataNom","index":14,"n_rows":2,"n_cols":16,"rows_kept":2,"cut":false,"hidden":true,"merged":[]}
[{"$f":"COUNTA(A3:A1048576)","v":0},null,null,null,null,null,null,null,null,null,{"$f":"COUNTA(K3:K1048576)","v":0}]
["ID","EMPID","Type","Name","Relationship","Allocation",null,null,null,null,"ID","EMPID","Type","Name","Relationship","Allocation"]